{"text_format":"1","workbook":"xlsx","n_sheets":14,"sheets":["設定","申込手順","入力シート","女子入力シート","男子団体メンバー用紙印刷","女子団体メンバー用紙印刷","申込書＿男子団体","申込書＿女子団体","申込書＿男子個人","申込書＿女子個人","入力シート (審判員等)","申込選手一覧（個人）","申込選手一覧sort（個人）","プログラム"],"not_rendered":{"charts":0,"images":2,"macros":1,"external_links":0,"defined_names":9,"comments":0,"pivot_tables":0},"unopened":[],"bounds":{"document_bytes":16777216,"sheet_cells":100000,"rows_first":2000,"rows_last":500,"rows_between":2000,"halvings":0,"cell_chars":16384,"cell_head_chars":4096},"cells_cut":0,"cells_raw":0,"read":"whole","date_system":"1900"}

{"sheet":"設定","index":0,"n_rows":64,"n_cols":25,"rows_kept":64,"cut":false,"hidden":true,"merged":[]}
["学年",null,"段位",null,"西暦",null,"月",null,"日",null,"男子階級",null,"女子階級",null,"番号","団体名","略",null,"申込締切年","申込締切月","申込締切日",null,"Ver",null,"大会回or年"]
["幼",null,"無",null,{"$f":"YEAR(TODAY())-F2","v":1961},65,1,null,1,null,"幼年",null,"52以下",null,1,"熊取柔道クラブ","熊取",null,2026,9,18,null,20260821,null,8]
[1,null,"初",null,1962,64,2,null,2,null,"小学生",null,"63以下",null,2,"泉佐野市柔道スポーツ少年団","泉佐野"]
[2,null,"弐",null,1963,63,3,null,3,null,"中学生男子",null,"無差別",null,3,"阪南市柔道スポーツ少年団","阪南"]
[3,null,"参",null,1964,62,4,null,4,null,"中学生女子",null,null,null,4,"貝塚市柔道クラブ","貝塚クラブ"]
[4,null,null,null,1965,61,5,null,5,null,"一般男子",null,null,null,5,"貝塚市柔道スポーツ少年団","貝塚少年"]
[5,null,null,null,1966,60,6,null,6,null,"一般女子"]
[6,null,null,null,1967,59,7,null,7]
{"$rows_left_out":57}
{"sheet":"申込手順","index":1,"n_rows":9,"n_cols":13,"rows_kept":9,"cut":false,"hidden":false,"merged":[[7,1,7,4],[7,5,7,11]]}
[]
[]
[null,null,"申込締切日：",{"$f":"設定!S2","v":2026},"年",{"$f":"設定!T2","v":9},"月",{"$f":"設定!U2","v":18},"日",{"$f":"\"（\"&TEXT(DATE(D3,F3,H3),\"aaa\")&\"）\"","v":"（金）"},"午後6時"]
[]
["①","入力済みのファイルを　ファイル＞名前を付けて保存＞で"]
[null,"ファイル名を　「　道場名　」に変更して保存してください。"]
[null,null,"例：entry.xlsm　→　「熊取柔道クラブ　.xlsm」"]
["②","①で保存したファイルをメールに添付して",null,null,null,"entry@kumatori-federation.osakajudo.net",null,null,null,null,null,null,"に送信してください"]
{"$rows_left_out":2}
{"sheet":"入力シート","index":2,"n_rows":38,"n_cols":18,"rows_kept":38,"cut":false,"hidden":false,"merged":[[1,3,1,5],[3,6,3,10],[1,6,1,10],[1,11,2,13],[4,12,4,13],[3,12,3,13],[6,7,7,7],[6,8,7,8],[6,9,7,9],[6,10,7,10],[6,2,7,2]]}
[]
[null,"道場番号：",null,{"$f":"IF(C2=\"\",\"番号が入力されていません。\",VLOOKUP(C2,_道場名[],2,FALSE))","v":"番号が入力されていません。"},null,null,"←番号で出なければ正式名称を\n　　　　　　　　　　　直接入力してください。",null,null,null,null,"【入　力　項　目】"]
[]
[null,null,"監督名：",null,"略称：",{"$f":"IF(C2=\"\",\"番号が入力されていません。\",VLOOKUP(C2,_道場名[],3,FALSE))","v":"番号が入力されていません。"},"←略称が適当でない場合は\n　　　　　　　　　　　直接入力してください。",null,null,null,null,"必須入力","リストから\n選択"]
[null,"※ふりがなは自動で入力されますが、違う場合は直接入力してください。",null,null,null,null,null,null,null,null,null,"直接入力","入力済み"]
[null,"個人戦",null,null,{"$f":"\"令和\"&設定!Y2&\"年熊取町民柔道大会　申込書\"","v":"令和8年熊取町民柔道大会　申込書"}]
[null,null,"階　級","選手名（ふりがな）",null,null,null,"学年","段位","体重(kg)","身長(cm)","生年月日"]
[null,null,null,"姓","名","せい","めい",null,null,null,null,"年(西暦)","月","日",null,null,"道場番号","団体名"]
{"$rows_left_out":31}
{"sheet":"女子入力シート","index":3,"n_rows":33,"n_cols":14,"rows_kept":33,"cut":false,"hidden":true,"merged":[[17,2,18,2],[17,7,18,7],[17,8,18,8],[17,9,18,9],[17,10,18,10],[1,11,2,13],[3,12,3,13],[4,12,4,13],[6,7,7,7],[6,8,7,8],[6,9,7,9],[6,10,7,10]]}
[]
[null,"学校番号：",null,{"$f":"IF(C2=\"\",\"学校番号が入力されていません。\",IF(C2=598,VLOOKUP(C2,_道場名[],2,FALSE),VLOOKUP(C2,_道場名[],2,FALSE)&\"高等学校\"))","v":"学校番号が入力されていません。"},null,null,null,null,null,null,null,"【入　力　項　目】"]
[]
[null,null,"監督名：",null,"校長名：",null,null,null,null,null,null,"必須入力","リストから\n選択"]
[null,"※ふりがなは自動で入力されますが、違う場合は直接入力してください。",null,null,null,null,null,null,null,null,null,"直接入力","入力済み"]
[null,"女子団体",null,null,{"$f":"入力シート!E6","v":"令和8年熊取町民柔道大会　申込書"}]
[null,null,"抽選番号","選手名（ふりがな）",null,null,null,"学年","段位","体重(kg)","身長(cm)","生年月日"]
[null,null,null,"姓","名","せい","めい",null,null,null,null,"年(西暦)","月","日"]
{"$rows_left_out":26}
{"sheet":"男子団体メンバー用紙印刷","index":4,"n_rows":23,"n_cols":12,"rows_kept":23,"cut":false,"hidden":true,"merged":[[1,6,1,9],[2,6,17,9],[19,10,21,10]]}
[]
[1," ",{"$f":"IF(入力シート!$C$2=\"\",\"\",VLOOKUP(入力シート!$C$2,_道場名[],3,FALSE))","v":""},1,null,null,{"$f":"INDEX(B2:B10,MATCH(K20,A2:A10))","v":" "}]
[2,"先",{"$f":"IF(入力シート!#REF!=\"\",\"\",入力シート!#REF!)","v":{"$error":"#REF!"}},{"$f":"IF(C3=\"\",1,COUNTIF($C$3:$C$10,C3))","v":{"$error":"#REF!"}},{"$f":"IF(D3>=2,LEFT(入力シート!#REF!,1),\"\")","v":{"$error":"#REF!"}},null,{"$f":"INDEX(C2:C10,MATCH(K20,A2:A10))","v":""}]
[3,"次",{"$f":"IF(入力シート!#REF!=\"\",\"\",入力シート!#REF!)","v":{"$error":"#REF!"}},{"$error":"#REF!"},{"$f":"IF(D4>=2,LEFT(入力シート!#REF!,1),\"\")","v":{"$error":"#REF!"}}]
[4,"中",{"$f":"IF(入力シート!#REF!=\"\",\"\",入力シート!#REF!)","v":{"$error":"#REF!"}},{"$error":"#REF!"},{"$f":"IF(D5>=2,LEFT(入力シート!#REF!,1),\"\")","v":{"$error":"#REF!"}}]
[5,"副",{"$f":"IF(入力シート!#REF!=\"\",\"\",入力シート!#REF!)","v":{"$error":"#REF!"}},{"$error":"#REF!"},{"$f":"IF(D6>=2,LEFT(入力シート!#REF!,1),\"\")","v":{"$error":"#REF!"}}]
[6,"大",{"$f":"IF(入力シート!#REF!=\"\",\"\",入力シート!#REF!)","v":{"$error":"#REF!"}},{"$error":"#REF!"},{"$f":"IF(D7>=2,LEFT(入力シート!#REF!,1),\"\")","v":{"$error":"#REF!"}}]
[7," ",{"$f":"IF(入力シート!#REF!=\"\",\"\",入力シート!#REF!)","v":{"$error":"#REF!"}},{"$error":"#REF!"},{"$f":"IF(D8>=2,LEFT(入力シート!#REF!,1),\"\")","v":{"$error":"#REF!"}}]
{"$rows_left_out":16}
{"sheet":"女子団体メンバー用紙印刷","index":5,"n_rows":23,"n_cols":12,"rows_kept":23,"cut":false,"hidden":true,"merged":[[1,6,1,9],[2,6,17,9],[19,10,21,10]]}
[]
[1," ",{"$f":"IF(女子入力シート!$C$2=\"\",\"\",VLOOKUP(女子入力シート!$C$2,_道場名[],3,FALSE))","v":""},1,null,null,{"$f":"INDEX(B2:B10,MATCH(K20,A2:A10))","v":" "}]
[2,"先",{"$f":"IF(女子入力シート!D9=\"\",\"\",女子入力シート!D9)","v":""},{"$f":"IF(C3=\"\",1,COUNTIF($C$3:$C$10,C3))","v":1},{"$f":"IF(D3>=2,LEFT(女子入力シート!E9,1),\"\")","v":""},null,{"$f":"INDEX(C2:C10,MATCH(K20,A2:A10))","v":""}]
[3,"中",{"$f":"IF(女子入力シート!D10=\"\",\"\",女子入力シート!D10)","v":""},1,{"$f":"IF(D4>=2,LEFT(女子入力シート!E10,1),\"\")","v":""}]
[4,"大",{"$f":"IF(女子入力シート!D11=\"\",\"\",女子入力シート!D11)","v":""},1,{"$f":"IF(D5>=2,LEFT(女子入力シート!E11,1),\"\")","v":""}]
[5,null,{"$f":"IF(女子入力シート!D12=\"\",\"\",女子入力シート!D12)","v":""},1,{"$f":"IF(D6>=2,LEFT(女子入力シート!E12,1),\"\")","v":""}]
[6,null,{"$f":"IF(女子入力シート!D13=\"\",\"\",女子入力シート!D13)","v":""},1,{"$f":"IF(D7>=2,LEFT(女子入力シート!E13,1),\"\")","v":""}]
[null," ",{"$f":"IF(女子入力シート!D14=\"\",\"\",女子入力シート!D14)","v":""},1,{"$f":"IF(D8>=2,LEFT(女子入力シート!E14,1),\"\")","v":""}]
{"$rows_left_out":16}
{"sheet":"申込書＿男子団体","index":6,"n_rows":22,"n_cols":10,"rows_kept":22,"cut":false,"hidden":true,"merged":[[18,8,19,8],[18,9,19,9],[19,2,19,3],[18,1,19,1],[18,2,18,3],[18,5,19,5],[18,6,19,6],[18,7,19,7],[6,1,7,1],[6,2,6,3],[7,2,7,3],[3,2,3,4],[2,2,2,4],[3,5,3,7],[3,8,3,9],[5,2,5,4],[4,2,4,4],[4,9,5,9],[4,8,5,8],[4,7,5,7],[4,6,5,6],[4,5,5,5],[10,8,11,8],[2,8,2,9],[2,5,2,7],[8,1,9,1],[8,2,8,3],[8,5,9,5],[8,6,9,6],[8,7,9,7],[8,8,9,8],[8,9,9,9],[9,2,9,3],[6,9,7,9],[6,8,7,8],[6,7,7,7],[6,6,7,6],[6,5,7,5],[14,8,15,8],[10,9,11,9],[11,2,11,3],[12,1,13,1],[12,2,12,3],[12,5,13,5],[12,6,13,6],[12,7,13,7],[12,8,13,8],[12,9,13,9],[13,2,13,3],[10,1,11,1],[10,2,10,3],[10,5,11,5],[10,6,11,6],[10,7,11,7],[1,3,1,7],[14,9,15,9],[15,2,15,3],[16,1,17,1],[16,2,16,3],[16,5,17,5],[16,6,17,6],[16,7,17,7],[16,8,17,8],[16,9,17,9],[17,2,17,3],[14,1,15,1],[14,2,14,3],[14,5,15,5],[14,6,15,6],[14,7,15,7],[20,8,21,8],[20,9,21,9],[21,2,21,3],[20,1,21,1],[20,2,20,3],[20,5,21,5],[20,6,21,6],[20,7,21,7]]}
[]
[null,"※抽選番号",null,{"$f":"入力シート!E6","v":"令和8年熊取町民柔道大会　申込書"},null,null,null,null,null,{"$f":"NOW()","v":"2026-08-25T17:36:43.470"}]
[null,"学校番号","学　　校　　名",null,null,"監　督　名",null,null,"校　長　名"]
[null,{"$f":"IF(入力シート!$C$2=\"\",\"\",入力シート!$C$2)","v":""},{"$f":"IF(ISERROR(入力シート!$D$2),\"\",入力シート!$D$2)","v":"番号が入力されていません。"},null,null,{"$f":"IF(入力シート!$D$4=\"\",\"監督名が入力されていません\",入力シート!$D$4)","v":"監督名が入力されていません"},null,null,{"$f":"IF(入力シート!$F$4=\"\",\"校長名が入力されていません\",入力シート!$F$4)","v":"番号が入力されていません。"}]
[null,null,"ふ　り　が　な",null,null,"学年","段位","体重(kg)","身長(cm)","生年月日(西暦)"]
[null,null,"選　　手　　名"]
[null,"先鋒",{"$f":"IF(入力シート!#REF!=\"\",\"\",入力シート!#REF!)","v":{"$error":"#REF!"}},null,{"$f":"IF(入力シート!#REF!=\"\",\"\",入力シート!#REF!)","v":{"$error":"#REF!"}},{"$f":"IF(入力シート!#REF!=\"\",\"\",入力シート!#REF!)","v":{"$error":"#REF!"}},{"$f":"IF(入力シート!#REF!=\"\",\"\",入力シート!#REF!)","v":{"$error":"#REF!"}},{"$f":"IF(入力シート!#REF!=\"\",\"\",入力シート!#REF!)","v":{"$error":"#REF!"}},{"$f":"IF(入力シート!#REF!=\"\",\"\",入力シート!#REF!)","v":{"$error":"#REF!"}},{"$f":"IF(OR(入力シート!#REF!=\"\",入力シート!#REF!=\"\",入力シート!#REF!=\"\"),\"\",入力シート!#REF!&\"・\"&入力シート!#REF!&\"・\"&入力シート!#REF!)","v":{"$error":"#REF!"}}]
[null,null,{"$f":"IF(入力シート!#REF!=\"\",\"\",入力シート!#REF!)","v":{"$error":"#REF!"}},null,{"$f":"IF(入力シート!#REF!=\"\",\"\",入力シート!#REF!)","v":{"$error":"#REF!"}}]
{"$rows_left_out":15}
{"sheet":"申込書＿女子団体","index":7,"n_rows":16,"n_cols":10,"rows_kept":16,"cut":false,"hidden":true,"merged":[[4,9,5,9],[5,2,5,4],[1,3,1,7],[2,2,2,4],[2,5,2,7],[2,8,2,9],[3,2,3,4],[3,5,3,7],[3,8,3,9],[4,2,4,4],[4,5,5,5],[4,6,5,6],[4,7,5,7],[4,8,5,8],[6,9,7,9],[7,2,7,3],[8,1,9,1],[8,2,8,3],[8,5,9,5],[8,6,9,6],[8,7,9,7],[8,8,9,8],[8,9,9,9],[9,2,9,3],[6,1,7,1],[6,2,6,3],[6,5,7,5],[6,6,7,6],[6,7,7,7],[6,8,7,8],[10,9,11,9],[11,2,11,3],[12,1,13,1],[12,2,12,3],[12,5,13,5],[12,6,13,6],[12,7,13,7],[12,8,13,8],[12,9,13,9],[13,2,13,3],[10,1,11,1],[10,2,10,3],[10,5,11,5],[10,6,11,6],[10,7,11,7],[10,8,11,8],[14,9,15,9],[15,2,15,3],[14,1,15,1],[14,2,14,3],[14,5,15,5],[14,6,15,6],[14,7,15,7],[14,8,15,8]]}
[]
[null,"※抽選番号",null,{"$f":"女子入力シート!E6","v":"令和8年熊取町民柔道大会　申込書"},null,null,null,null,null,{"$f":"NOW()","v":"2026-08-25T17:36:43.470"}]
[null,"学校番号","学　　校　　名",null,null,"監　督　名",null,null,"校　長　名"]
[null,{"$f":"IF(女子入力シート!$C$2=\"\",\"\",女子入力シート!$C$2)","v":""},{"$f":"IF(ISERROR(女子入力シート!$D$2),\"\",女子入力シート!$D$2)","v":"学校番号が入力されていません。"},null,null,{"$f":"IF(女子入力シート!$D$4=\"\",\"監督名が入力されていません\",女子入力シート!$D$4)","v":"監督名が入力されていません"},null,null,{"$f":"IF(女子入力シート!$F$4=\"\",\"校長名が入力されていません\",女子入力シート!$F$4)","v":"校長名が入力されていません"}]
[null,null,"ふ　り　が　な",null,null,"学年","段位","体重(kg)","身長(cm)","生年月日(西暦)"]
[null,null,"選　　手　　名"]
[null,"先鋒",{"$f":"IF(女子入力シート!F9=\"\",\"\",女子入力シート!F9)","v":""},null,{"$f":"IF(女子入力シート!G9=\"\",\"\",女子入力シート!G9)","v":""},{"$f":"IF(女子入力シート!H9=\"\",\"\",女子入力シート!H9)","v":""},{"$f":"IF(女子入力シート!I9=\"\",\"\",女子入力シート!I9)","v":""},{"$f":"IF(女子入力シート!J9=\"\",\"\",女子入力シート!J9)","v":""},{"$f":"IF(女子入力シート!K9=\"\",\"\",女子入力シート!K9)","v":""},{"$f":"IF(OR(女子入力シート!L9=\"\",女子入力シート!M9=\"\",女子入力シート!N9=\"\"),\"\",女子入力シート!L9&\"・\"&女子入力シート!M9&\"・\"&女子入力シート!N9)","v":""}]
[null,null,{"$f":"IF(女子入力シート!D9=\"\",\"\",女子入力シート!D9)","v":""},null,{"$f":"IF(女子入力シート!E9=\"\",\"\",女子入力シート!E9)","v":""}]
{"$rows_left_out":9}
{"sheet":"申込書＿男子個人","index":8,"n_rows":27,"n_cols":13,"rows_kept":27,"cut":false,"hidden":true,"merged":[[24,5,24,7],[24,8,24,10],[24,11,24,12],[25,5,25,6],[26,5,26,6],[7,5,7,7],[7,8,7,10],[7,11,7,12],[8,5,8,6],[23,5,23,7],[23,8,23,10],[23,11,23,12],[9,5,9,6],[16,8,17,8],[21,6,21,10],[22,7,22,12],[4,6,4,10],[5,7,5,12],[6,5,6,7],[6,8,6,10],[6,11,6,12]]}
[]
[null,{"$f":"MAX(B3:B9)","v":15}]
[1,{"$f":"入力シート!B9","v":9},23]
[2,{"$f":"入力シート!B10","v":10},24]
[3,{"$f":"入力シート!B11","v":11},null,null,null,null,"個　人　試　合　申　込　書",null,null,null,null,null,{"$f":"NOW()","v":"2026-08-25T17:36:43.470"}]
[4,{"$f":"入力シート!B12","v":12},null,null,"※抽選番号",null,{"$f":"INDIRECT(\"男子入力シート!C\"&$C$3)&\"kg級\"","v":{"$error":"#REF!"}},{"$f":"入力シート!$E$6","v":"令和8年熊取町民柔道大会　申込書"}]
[5,{"$f":"入力シート!B13","v":13},null,null,"学校番号","学　　校　　名",null,null,"監　督　名",null,null,"校　長　名"]
[6,{"$f":"入力シート!B14","v":14},null,null,{"$f":"IF(入力シート!$C$2=\"\",\"\",入力シート!$C$2)","v":""},{"$f":"入力シート!$D$2","v":"番号が入力されていません。"},null,null,{"$f":"IF(入力シート!$D$4=\"\",\"監督名が入力されていません\",入力シート!$D$4)","v":"監督名が入力されていません"},null,null,{"$f":"IF(入力シート!$F$4=\"\",\"校長名が入力されていません\",入力シート!$F$4)","v":"番号が入力されていません。"}]
{"$rows_left_out":20}
{"sheet":"申込書＿女子個人","index":9,"n_rows":27,"n_cols":13,"rows_kept":27,"cut":false,"hidden":true,"merged":[[23,5,23,7],[23,8,23,10],[23,11,23,12],[4,6,4,10],[5,7,5,12],[6,5,6,7],[6,8,6,10],[6,11,6,12],[7,5,7,7],[7,8,7,10],[7,11,7,12],[8,5,8,6],[9,5,9,6],[16,8,17,8],[21,6,21,10],[22,7,22,12],[24,5,24,7],[24,8,24,10],[24,11,24,12],[25,5,25,6],[26,5,26,6]]}
[]
[null,{"$f":"MAX(B3:B16)","v":0}]
[1,{"$f":"女子入力シート!B20","v":""},20]
[2,{"$f":"女子入力シート!B21","v":""},21]
[3,{"$f":"女子入力シート!B22","v":""},null,null,null,null,"個　人　試　合　申　込　書",null,null,null,null,null,{"$f":"NOW()","v":"2026-08-25T17:36:43.470"}]
[4,{"$f":"女子入力シート!B23","v":""},null,null,"※抽選番号",null,{"$f":"IF(INDIRECT(\"女子入力シート!C\"&$C$3)=\"無差別\",\"無差別\",INDIRECT(\"女子入力シート!C\"&$C$3)&\"kg級\")","v":"kg級"},{"$f":"女子入力シート!$E$6","v":"令和8年熊取町民柔道大会　申込書"}]
[5,{"$f":"女子入力シート!B24","v":""},null,null,"学校番号","学　　校　　名",null,null,"監　督　名",null,null,"校　長　名"]
[6,{"$f":"女子入力シート!B25","v":""},null,null,{"$f":"IF(女子入力シート!$C$2=\"\",\"\",女子入力シート!$C$2)","v":""},{"$f":"女子入力シート!$D$2","v":"学校番号が入力されていません。"},null,null,{"$f":"IF(女子入力シート!$D$4=\"\",\"監督名が入力されていません\",女子入力シート!$D$4)","v":"監督名が入力されていません"},null,null,{"$f":"IF(女子入力シート!$F$4=\"\",\"校長名が入力されていません\",女子入力シート!$F$4)","v":"校長名が入力されていません"}]
{"$rows_left_out":20}
{"sheet":"入力シート (審判員等)","index":10,"n_rows":15,"n_cols":7,"rows_kept":15,"cut":false,"hidden":false,"merged":[[1,6,1,10]]}
[]
[null,null,null,{"$f":"入力シート!D2","v":"番号が入力されていません。"}]
[]
[null,null,"監督名：",{"$f":"入力シート!D4","v":0},"略称：",{"$f":"入力シート!F4","v":"番号が入力されていません。"}]
[null,"※ふりがなは自動で入力されますが、違う場合は直接入力してください。"]
[null,null,{"$f":"\"令和\"&設定!Y2&\"年熊取町民柔道大会　協力審判員\"","v":"令和8年熊取町民柔道大会　協力審判員"}]
[null,null,"協力審判員名（ふりがな）"]
[null,null,"姓","名","せい","めい"]
{"$rows_left_out":8}
{"sheet":"申込選手一覧（個人）","index":11,"n_rows":31,"n_cols":10,"rows_kept":31,"cut":false,"hidden":false,"merged":[]}
[null,"階級","エントリー用","団体名","姓","名","ふりがな","学年","段位","団体番号"]
[1,{"$f":"IF(入力シート!C9=\"\",\"\",入力シート!C9)","v":""},{"$f":"IF(E2=\"\",\"\",E2&\"　\"&F2&\"（\"&I2&\"）\")","v":""},{"$f":"IF(E2=\"\",\"\",VLOOKUP(入力シート!$C$2,_道場名[],3,FALSE))","v":""},{"$f":"IF(入力シート!D9=\"\",\"\",入力シート!D9)","v":""},{"$f":"IF(入力シート!E9=\"\",\"\",入力シート!E9)","v":""},{"$f":"IF(E2=\"\",\"\",入力シート!F9&\"　\"&入力シート!G9)","v":""},{"$f":"IF(E2=\"\",\"\",入力シート!H9)","v":""},{"$f":"IF(E2=\"\",\"\",IF(入力シート!I9=0,\"無\",入力シート!I9))","v":""},{"$f":"IF(E2=\"\",\"\",入力シート!$C$2)","v":""}]
[2,{"$f":"IF(入力シート!C10=\"\",\"\",入力シート!C10)","v":""},"",{"$f":"IF(E3=\"\",\"\",VLOOKUP(入力シート!$C$2,_道場名[],3,FALSE))","v":""},{"$f":"IF(入力シート!D10=\"\",\"\",入力シート!D10)","v":""},{"$f":"IF(入力シート!E10=\"\",\"\",入力シート!E10)","v":""},{"$f":"IF(E3=\"\",\"\",入力シート!F10&\"　\"&入力シート!G10)","v":""},{"$f":"IF(E3=\"\",\"\",入力シート!H10)","v":""},{"$f":"IF(E3=\"\",\"\",IF(入力シート!I10=0,\"無\",入力シート!I10))","v":""},{"$f":"IF(E3=\"\",\"\",入力シート!$C$2)","v":""}]
[3,{"$f":"IF(入力シート!C11=\"\",\"\",入力シート!C11)","v":""},"",{"$f":"IF(E4=\"\",\"\",VLOOKUP(入力シート!$C$2,_道場名[],3,FALSE))","v":""},{"$f":"IF(入力シート!D11=\"\",\"\",入力シート!D11)","v":""},{"$f":"IF(入力シート!E11=\"\",\"\",入力シート!E11)","v":""},{"$f":"IF(E4=\"\",\"\",入力シート!F11&\"　\"&入力シート!G11)","v":""},{"$f":"IF(E4=\"\",\"\",入力シート!H11)","v":""},{"$f":"IF(E4=\"\",\"\",IF(入力シート!I11=0,\"無\",入力シート!I11))","v":""},{"$f":"IF(E4=\"\",\"\",入力シート!$C$2)","v":""}]
[4,{"$f":"IF(入力シート!C12=\"\",\"\",入力シート!C12)","v":""},"",{"$f":"IF(E5=\"\",\"\",VLOOKUP(入力シート!$C$2,_道場名[],3,FALSE))","v":""},{"$f":"IF(入力シート!D12=\"\",\"\",入力シート!D12)","v":""},{"$f":"IF(入力シート!E12=\"\",\"\",入力シート!E12)","v":""},{"$f":"IF(E5=\"\",\"\",入力シート!F12&\"　\"&入力シート!G12)","v":""},{"$f":"IF(E5=\"\",\"\",入力シート!H12)","v":""},{"$f":"IF(E5=\"\",\"\",IF(入力シート!I12=0,\"無\",入力シート!I12))","v":""},{"$f":"IF(E5=\"\",\"\",入力シート!$C$2)","v":""}]
[5,{"$f":"IF(入力シート!C13=\"\",\"\",入力シート!C13)","v":""},"",{"$f":"IF(E6=\"\",\"\",VLOOKUP(入力シート!$C$2,_道場名[],3,FALSE))","v":""},{"$f":"IF(入力シート!D13=\"\",\"\",入力シート!D13)","v":""},{"$f":"IF(入力シート!E13=\"\",\"\",入力シート!E13)","v":""},{"$f":"IF(E6=\"\",\"\",入力シート!F13&\"　\"&入力シート!G13)","v":""},{"$f":"IF(E6=\"\",\"\",入力シート!H13)","v":""},{"$f":"IF(E6=\"\",\"\",IF(入力シート!I13=0,\"無\",入力シート!I13))","v":""},{"$f":"IF(E6=\"\",\"\",入力シート!$C$2)","v":""}]
[6,{"$f":"IF(入力シート!C14=\"\",\"\",入力シート!C14)","v":""},"",{"$f":"IF(E7=\"\",\"\",VLOOKUP(入力シート!$C$2,_道場名[],3,FALSE))","v":""},{"$f":"IF(入力シート!D14=\"\",\"\",入力シート!D14)","v":""},{"$f":"IF(入力シート!E14=\"\",\"\",入力シート!E14)","v":""},{"$f":"IF(E7=\"\",\"\",入力シート!F14&\"　\"&入力シート!G14)","v":""},{"$f":"IF(E7=\"\",\"\",入力シート!H14)","v":""},{"$f":"IF(E7=\"\",\"\",IF(入力シート!I14=0,\"無\",入力シート!I14))","v":""},{"$f":"IF(E7=\"\",\"\",入力シート!$C$2)","v":""}]
[7,{"$f":"IF(入力シート!C15=\"\",\"\",入力シート!C15)","v":""},"",{"$f":"IF(E8=\"\",\"\",VLOOKUP(入力シート!$C$2,_道場名[],3,FALSE))","v":""},{"$f":"IF(入力シート!D15=\"\",\"\",入力シート!D15)","v":""},{"$f":"IF(入力シート!E15=\"\",\"\",入力シート!E15)","v":""},{"$f":"IF(E8=\"\",\"\",入力シート!F15&\"　\"&入力シート!G15)","v":""},{"$f":"IF(E8=\"\",\"\",入力シート!H15)","v":""},{"$f":"IF(E8=\"\",\"\",IF(入力シート!I15=0,\"無\",入力シート!I15))","v":""},{"$f":"IF(E8=\"\",\"\",入力シート!$C$2)","v":""}]
{"$rows_left_out":24}
{"sheet":"申込選手一覧sort（個人）","index":12,"n_rows":2,"n_cols":9,"rows_kept":2,"cut":false,"hidden":false,"merged":[]}
["階級","エントリー用","団体名","姓","名","ふりがな","学年","段位","団体番号"]
[{"$f":"_xlfn._xlws.SORT(_xlfn._xlws.FILTER('申込選手一覧（個人）'!B2:J31,'申込選手一覧（個人）'!D2:D31<>\"\",\"\"),7)","v":{"$error":"#VALUE!"}}]

{"sheet":"プログラム","index":13,"n_rows":22,"n_cols":36,"rows_kept":22,"cut":false,"hidden":true,"merged":[[1,3,1,6],[2,5,2,6],[9,1,9,2],[10,1,10,2],[11,1,11,2],[4,1,4,2],[5,1,5,2],[6,1,6,2],[7,1,7,2],[8,1,8,2],[20,1,20,2],[21,1,21,2],[14,3,14,6],[15,5,15,6],[17,1,17,2],[18,1,18,2],[19,1,19,2]]}
[]
[null,"No.",null,{"$f":"IF(入力シート!C2=\"\",\"\",入力シート!D2)","v":""}]
[null,null,null,null,"監督：",{"$f":"IF(入力シート!D4=\"\",\"\",入力シート!D4)","v":""},null,{"$f":"IF(入力シート!#REF!=\"\",\"\",入力シート!#REF!)","v":{"$error":"#REF!"}},"昇段用データ",null,"男子",null,null,null,null,null,null,null,null,null,null,null,null,null,null,null,"女子"]
[null,null,null,"名前","段","体重","身長",{"$f":"IF(入力シート!#REF!=\"\",\"\",入力シート!#REF!)","v":{"$error":"#REF!"}},"男子高校名","女子高校名","先","次","中","副","大","補1","補2","補3","先　段","次　段","中　段","副　段","大　段","補1　　段","補2　段","補3　段","先","中","大","補1","補2","先　段","中　段","大　段","補1　　段","補2　段"]
[null,"先　鋒",null,{"$f":"IF(入力シート!#REF!=\"\",\"\",入力シート!#REF!&\"　\"&入力シート!#REF!)","v":{"$error":"#REF!"}},{"$f":"IF(入力シート!#REF!=\"\",\"\",入力シート!#REF!)","v":{"$error":"#REF!"}},{"$f":"IF(入力シート!#REF!=\"\",\"\",入力シート!#REF!)","v":{"$error":"#REF!"}},{"$f":"IF(入力シート!#REF!=\"\",\"\",入力シート!#REF!)","v":{"$error":"#REF!"}},{"$f":"IF(入力シート!#REF!=\"\",\"\",入力シート!#REF!)","v":{"$error":"#REF!"}},{"$f":"D2","v":""},{"$f":"D15","v":""},{"$f":"D5","v":{"$error":"#REF!"}},{"$f":"D6","v":{"$error":"#REF!"}},{"$f":"D7","v":{"$error":"#REF!"}},{"$f":"D8","v":{"$error":"#REF!"}},{"$f":"D9","v":{"$error":"#REF!"}},{"$f":"D10","v":{"$error":"#REF!"}},{"$f":"D11","v":{"$error":"#REF!"}},{"$f":"D12","v":{"$error":"#REF!"}},{"$f":"E5","v":{"$error":"#REF!"}},{"$f":"E6","v":{"$error":"#REF!"}},{"$f":"E7","v":{"$error":"#REF!"}},{"$f":"E8","v":{"$error":"#REF!"}},{"$f":"E9","v":{"$error":"#REF!"}},{"$f":"E10","v":{"$error":"#REF!"}},{"$f":"E11","v":{"$error":"#REF!"}},{"$f":"E12","v":{"$error":"#REF!"}},{"$f":"D18","v":""},{"$f":"D19","v":""},{"$f":"D20","v":""},{"$f":"D21","v":""},{"$f":"D22","v":""},{"$f":"E18","v":""},{"$f":"E19","v":""},{"$f":"E20","v":""},{"$f":"E21","v":""},{"$f":"E22","v":""}]
[null,"次　鋒",null,{"$f":"IF(入力シート!#REF!=\"\",\"\",入力シート!#REF!&\"　\"&入力シート!#REF!)","v":{"$error":"#REF!"}},{"$f":"IF(入力シート!#REF!=\"\",\"\",入力シート!#REF!)","v":{"$error":"#REF!"}},{"$f":"IF(入力シート!#REF!=\"\",\"\",入力シート!#REF!)","v":{"$error":"#REF!"}},{"$f":"IF(入力シート!#REF!=\"\",\"\",入力シート!#REF!)","v":{"$error":"#REF!"}},{"$f":"IF(入力シート!#REF!=\"\",\"\",入力シート!#REF!)","v":{"$error":"#REF!"}}]
[null,"中　堅",null,{"$f":"IF(入力シート!#REF!=\"\",\"\",入力シート!#REF!&\"　\"&入力シート!#REF!)","v":{"$error":"#REF!"}},{"$f":"IF(入力シート!#REF!=\"\",\"\",入力シート!#REF!)","v":{"$error":"#REF!"}},{"$f":"IF(入力シート!#REF!=\"\",\"\",入力シート!#REF!)","v":{"$error":"#REF!"}},{"$f":"IF(入力シート!#REF!=\"\",\"\",入力シート!#REF!)","v":{"$error":"#REF!"}},{"$f":"IF(入力シート!#REF!=\"\",\"\",入力シート!#REF!)","v":{"$error":"#REF!"}}]
[null,"副　将",null,{"$f":"IF(入力シート!#REF!=\"\",\"\",入力シート!#REF!&\"　\"&入力シート!#REF!)","v":{"$error":"#REF!"}},{"$f":"IF(入力シート!#REF!=\"\",\"\",入力シート!#REF!)","v":{"$error":"#REF!"}},{"$f":"IF(入力シート!#REF!=\"\",\"\",入力シート!#REF!)","v":{"$error":"#REF!"}},{"$f":"IF(入力シート!#REF!=\"\",\"\",入力シート!#REF!)","v":{"$error":"#REF!"}},{"$f":"IF(入力シート!#REF!=\"\",\"\",入力シート!#REF!)","v":{"$error":"#REF!"}}]
{"$rows_left_out":14}